LOD SRTI DATEX II ROADS
type: Ontology
contributor: Tam Tam Research, CVUT, ESAM Technologies and LMT.
created: 2022/03/31
creator: Julian Gutierrez Moret (https://www.uv.es/uvweb/universidad/es/ficha-persona-1285950309813.html?p2=gumoju) J. Javier Samper Zapater (https://www.uv.es/uvweb/college/en/profile-1285950309813.html?p2=jjsamper&idA=true) IRTIC - (Instituto de Robótica y Tecnologías de la Información y la Comunicación)
description: An RDF/OWL vocabulary to represent Road Numbers within the european LOD-RoadTran18 project (INEA/CEF/ICT/A2018/1803421).
license: https://creativecommons.org/licenses/by/4.0/
publisher: IRTIC - (Instituto de Robotica y Tecnologias de la Informacion y la Comunicacion) @es
preferred namespace prefix: roads @es
comment: The link class in dtx_srti is RoadNumber (range): - dtx_srti:LinearElement dtx_srti:hasRoadNumber max 1 roads#RoadNumber - dtx_srti:RoadInformation dtx_srti:hasRoadNumber max 1 roads#RoadNumber Use in Instances: <dtx_srti:LinearElement> <dtx_srti:hasRoadNumber rdf:resource="https://cef.uv.es/lodroadtran18/recurso/transporte/dtx_srti/roads/CarreterasRCE/A-3"/> </dtx_srti:LinearElement> or for TPEG descriptions for linkName: <dtx_x_srti:TpegOtherPointDescriptor> <dtx_srti:descriptor rdf:resource="https://cef.uv.es/lodroadtran18/recurso/transporte/dtx_srti/roads/CarreterasRCE/A-3"/> <dtx_srti:hasTpegOtherPointDescriptorType rdf:resource="http://cef.uv.es/lodroadtran18/def/transporte/dtx_srti#linkName"/> </dtx_srti:TpegOtherPointDescriptor>
comment: This specific ontology is used in the main dtx_srti to identification of the road number detailed in RoadInformation or in LinearElement.
version info: 1.0
change note: 2021-12-14 - Included individuals of Road Spanish National Catalog (date 2020) (https://www.mitma.gob.es/areas-de-actividad/carreteras/catalogo-y-evolucion-de-la-red-de-carreteras/catalogo-de-la-rce/catalogo-de-la-rce-2011-2012-2013-y-2014 ) to obtain more information. For example, information about sections of the roads. For this D2RQ tool was used (Excel-->MySQL-->RDF).
change note: 2021-12-18 - Related with IGN BTN100 carreteras - Included links in road sections individuals of Road Spanish National Catalog to BTN100, in order to capture the information related to the Autonomous Communities or Cities (Melilla or Ceuta) and the provinces where the section is located. Province: https://datos.ign.es/page/recurso/btn100/provincia/ Autonomous Community: https://datos.ign.es/page/recurso/btn100/comunidad-autonoma/ Autonomous City: https://datos.ign.es/page/recurso/btn100/ciudad-autonoma/ roads:tramos_Provincia <https://datos.ign.es/recurso/btn100/provincia/madrid> ; roads:tramos_CCAA <https://datos.ign.es/recurso/btn100/comunidad-autonoma/comunidad-de-madrid> ;
change note: 2022-08-04: Added Czech terms.

numericUnion
type: Datatype
comment: A datatype that is the union of numeric xsd data types. "numericUnion" is equivalent to the xsd specification that uses an xsd:union of memberTypes="xsd:decimal xsd:double xsd:float xsd:integer".

length
type: Datatype
comment: length Datatype (https://w3id.org/cdt/length) from Custom Datatypes for Quantity Values (cdt) - Datatype to encode measurement of quantity kind length in a simple literal.
is defined by: @prefix cdt: <http://w3id.org/lindt/custom_datatypes#>.

cCAA_Tramos
type: ObjectProperty
inverse of: tramos_CCAA
domain: Autonomia
range: sectionsRCE
comment: Inverse property of tramos_CCAA
comment: sections associated to a Autonomous community
comment: Propiedad Inversa de tramos_CCAA
comment: Tramos asociados a una CCAA.

carretera_COD_Tramos
type: ObjectProperty
inverse of: tramos_carretera_COD
domain: roadsRCE
range: sectionsRCE
comment: Road sections for the Code of the road

invUnit
type: ObjectProperty
sub property of: topObjectProperty
inverse of: unit
domain: Unit
range: QuantityValue
comment: unit inverse

long_Tramos
type: ObjectProperty
sub property of: topObjectProperty
inverse of: tramos_Long
domain: KilometresAsFloatValue
range: sectionsRCE
comment: Road sections with a length in kilometers

provincia_Tramos
type: ObjectProperty
inverse of: tramos_Provincia
domain: Provincia
range: sectionsRCE
comment: Road Sections of a Province
comment: Tramos de una provincia @es

tipo_Acceso_Tramos
type: ObjectProperty
inverse of: tramos_Tipo_Acceso
domain: tipo-acceso
range: sectionsRCE
comment: Road sections for Free or toll access. It is represented by the concept scheme: https://datos.ign.es/kos/transportes/tipo-acceso and can take any of the following values: https://datos.ign.es/kos/transportes/tipo- toll/access https://datos.ign.es/kos/transportes/tipo-acceso/libre

tipo_Via_Tramos
type: ObjectProperty
inverse of: tramos_Tipo_Via
domain: RoadSpain
range: sectionsRCE
comment: road sections for a Type of Road

tramos_CCAA
type: ObjectProperty
domain: sectionsRCE
range: Autonomia
comment: Autonomous Community or city (Melilla o Ceuta) where the section is located
comment: CCAA o Ciudad Autónoma (Melilla o Ceuta) a la que pertenece el tramo @es

tramos_Long
type: ObjectProperty
domain: sectionsRCE
range: KilometresAsFloatValue
comment: Longitud en Kms del tramo @es
comment: Section length in kilometers
comment: Use Qudt (QuantitiveValue) in order to specify the length of the sections: roads:tramos_Long [ qudt:quantityValue [ qudt:unit qudt-unit:KiloM ; qudt:numericValue "14.0"^^xsd:float ] ] ;

tramos_Provincia
type: ObjectProperty
domain: sectionsRCE
range: Provincia
comment: Province where the section is located
comment: Provincia a la que pertenece el tramo @es

tramos_Tipo_Acceso
type: ObjectProperty
domain: sectionsRCE
range: tipo-acceso
comment: Acceso libre o de peaje. Se representa mediante el esquema de conceptos: https://datos.ign.es/kos/transportes/tipo-acceso y puede tomar alguno de los siguientes valores: https://datos.ign.es/kos/transportes/tipo-acceso/de-peaje https://datos.ign.es/kos/transportes/tipo-acceso/libre @es
comment: Free or toll access. It is represented by the concept scheme: https://datos.ign.es/kos/transportes/tipo-acceso and can take any of the following values: https://datos.ign.es/kos/transportes/tipo- toll/access https://datos.ign.es/kos/transportes/tipo-acceso/libre

tramos_Tipo_Via
type: ObjectProperty
domain: sectionsRCE
range: RoadSpain
comment: Type of Road of a road section

tramos_carretera_COD
type: ObjectProperty
domain: sectionsRCE
range: roadsRCE
comment: Code of the road for the road section
comment: Código de la carretera a la que pertence el tramo @es

unit
type: ObjectProperty
domain: QuantityValue
range: Unit
comment: A reference to the unit of measure of a quantity (variable or constant) of interest.

code ALERT-C
type: DatatypeProperty
domain: RoadCzech
range: Literal
comment: Linear location code referencing the country location table, for the purpose of full identification, consisting of country code CID=(0-F), table code TABCD=(00-99) and location code (0-65000). for the Czech Republic CID=2, TABCD=25 Ref: 2.25.180 (Prague-Cakovice area code)
comment: kód liniového úseku odkazující do lokační tabulky dané země, pro potřeby celistvé identifikace s skládá z kódu země CID=(0-F), kódu tabulky TABCD=(00-99) a kódu lokace (0-65000). pro ČR CID=2, TABCD=25 př: 2.25.180 (kód oblasti Praha-Čakovice) @cs
label: kód ALERT-C @cs

carretera_COD
type: DatatypeProperty
equivalent property: číslo PK
domain: roadsRCE
range: Literal
comment: Code for the road
comment: Identificador de una carretera @es

carretera_Denominacion
type: DatatypeProperty
equivalent property: název PK
domain: roadsRCE
range: Literal
comment: Denominación de una carretera @es
comment: Road Nomenclature

carretera_Itinerario
type: DatatypeProperty
domain: roadsRCE
domain: RoadCzech
range: Literal
comment: Itinerario de referencia O/D @es
comment: Road Itinerary

konec PK
type: DatatypeProperty
domain: RoadCzech
range: Literal
comment: name of the place (intersection) where road with respective number ends
comment: název místa ve kterém komunikace končí, ve smeru staničení @cs

název PK
type: DatatypeProperty
domain: RoadCzech
range: Literal
comment: název komunikace / ulice @cs
comment: road / street name

tramos_Fin
type: DatatypeProperty
domain: sectionsRCE
range: Literal
comment: End of te section
comment: Especificación del final del tramo @es

tramos_ID
type: DatatypeProperty
domain: sectionsRCE
range: integer
comment: Identificador del tramo @es
comment: Identifier for the section

tramos_Inicio
type: DatatypeProperty
domain: sectionsRCE
range: Literal
comment: Especificación de inicio del tramo @es
comment: Start of the section

tramos_Longitud
type: DatatypeProperty
domain: sectionsRCE
range: length
comment: Longitud en Kms del tramo @es
comment: Section length in kilometers
comment: Use CDT: roads:tramos_Longitud "14.0 km"^^<https://w3id.org/cdt/length>

tramos_PK_Fin
type: DatatypeProperty
domain: sectionsRCE
range: Literal
comment: Final kilometer point
comment: Punto kilométrico del final del tramo @es

tramos_PK_Inicio
type: DatatypeProperty
domain: sectionsRCE
range: Literal
comment: Initial kilometer point
comment: Punto kilométrico del inicio del tramo @es

trasa PK
type: DatatypeProperty
domain: RoadCzech
range: Literal
comment: The route of an overland road, defined by the beginning, end and significant points through which the road passes
comment: Trasa pozemní komunikace, stanovena počátkem, koncem a významnými body přes které komunikace prochází @cs

začátek PK
type: DatatypeProperty
domain: RoadCzech
range: Literal
comment: name of the place (intersection) where road with respective number begins
comment: název místa (křížení) kde daná pozemná komunikace začíná, ve směru staničení @cs

číslo PK
type: DatatypeProperty
domain: RoadCzech
range: Literal
comment: road number
comment: číslo pozemní komunikace @cs

numericValue
type: DatatypeProperty
domain: QuantityValue
range: numericUnion
comment: Numeric value

codigoINE
type: DatatypeProperty
domain: UnidadAdministrativa
range: Literal
comment: Code of the territorial entity according to INE (National Statistics Institute. Spanish Statistical Office).

Autopista_Autovia
type: Class
subclass of: RoadSpain
comment: Para especificar el tipo de via en tramo de "Autopista Libre \ Autovía" tal y como lo hace el catálogo oficial de carreteras, sin discernir entre Autopistas y Autovías. @es
comment: To specify the type of road in a section of "Freeway \ Highway" as the official road catalog does, without distinguishing between "Autopistas" and "Autovias".

Carretera_Convencional
type: Class
subclass of: RoadSpain
comment: Es cualquier vía fuera de poblado que no sea autovía, autopista o vía para automóviles. Estas carreteras no urbanas tienen doble sentido de circulación en la misma calzada, es decir, no tienen una separación física que divida las calzadas, a diferencia de las autopistas y autovías. @es
comment: It is any road outside the town that is not a highway, motorway or road for cars. These non-urban roads have two-way traffic on the same road, that is, they do not have a physical separation that divides the roads, unlike motorways and dual carriageways.

roadsRCE
type: Class
equivalent class: RoadSpain
subclass of: RoadNumber
comment: Name of the roads included in the ROAD CATALOG OF THE NETWORK OF GENERAL INTEREST OF THE Spanish STATE.
comment: Nombres de carreteras recogidos en el CATALOGO DE CARRETERAS DE LA RED DE INTERES GENERAL DEL ESTADO español. @es
label: CarreterasRCE @es

Motorway
type: Class
subclass of: RoadCzech
disjoint with: Road
comment: Communication route consist of different roads for each direction, separated by a median, characterized by not having access to the adjoining properties; not crossing any other road at the level and pedestrians are strictly forbidden.
comment: Dálnice (ze slov dálková silnice,[1] zastarale autostráda) je rychlostní komunikace pro motorová silniční vozidla a je to nejvyšší typ pozemní komunikace, která se staví na nejzatíženějších dálkových vnitrostátních a mezinárodních tazích. Oproti silnicím je na dálnicích obecně povolena vyšší rychlost a jsou zde použity vyšší technické parametry. Na dálnici je přísně zakázán pohyb pěších osob. [wiki] @cs
comment: Pozemní komunikace určená pro rychlou dálkovou a mezistátní dopravu silničními motorovými vozidly, která je budována bez úrovňových křížení, s oddělenými místy napojení pro vjezd a výjezd a která má směrově oddělené jízdní pásy. @cs
label: Dálnice @cs

KilometresAsFloatValue
type: Class
subclass of: QuantityValue
subclass of: Restriction
  has value: Kilometre
  on property: unit
subclass of: Restriction
  some values from: float
  on property: numericValue
comment: A measure of distance defined in kilometres in a floating point format.
comment: Is a qudt:QuantityValue in Kilometre(s) and with a numeric value xsd:float
comment: SPARQL: ?tramo roads:tramos_Long [ qudt:quantityValue [ qudt:unit ?units ; qudt:numericValue ?length ] ]

Multicarril
type: Class
subclass of: RoadSpain
comment: Sin ser autopistas o autovías, tienen al menos dos carriles destinados a la circulación para cada sentido, con separación o delimitación de los mismos, pudiendo tener accesos o cruces a nivel. @es
comment: Without being highways or dual carriageways, they have at least two lanes for circulation in each direction, with separation or delimitation of the same, and may have accesses or level crossings.

Local Road
type: Class
subclass of: RoadCzech
comment: Místní komunikace je veřejně přístupná pozemní komunikace, která slouží převážně místní dopravě na území obce. @cs
comment: Silnice III. třídy existují v České republice a na Slovensku v návaznosti na československý systém klasifikace silnic, zavedený na základě silničního zákona č. 135/1961 Sb. V Česku jsou podle zákona o pozemních komunikacích (č. 13/1997 Sb., § 5) určeny k vzájemnému spojení obcí nebo jejich napojení na ostatní pozemní komunikace. Jde o nejnižší kategorii silnic (obecní komunikace od roku 1961 již nespadají do pojmu silnice). Silnice III. třídy (z historických důvodů tradičně nazývané okresní silnice), stejně jako silnice II. třídy, musí v České republice na základě zákona o pozemních komunikacích vlastnit kraj, na jehož území se silnice nachází. [wiki] @cs
label: Místí Komunikace @cs

RoadCzech
type: Class
subclass of: RoadNumber
subclass of: Objeto Geográfico
subclass of: Restriction
  all values from: string
  on property: code ALERT-C
comment: A road is a thoroughfare intended for use by road and other vehicles and pedestrians, including fixed facilities necessary to ensure such use and its safety.
comment: Pozemní komunikace je dopravní cesta určená k užití silničními a jinými vozidly a chodci, včetně pevných zařízení nutných pro zajištění tohoto užití a jeho bezpečnosti. @cs

RoadNumber
type: Class
subclass of: RoadsDefinitions
comment: Used in DATEX to identify the road through a road number designated by the road authority

RoadsDefinitions
type: Class
subclass of: Thing
comment: Roads Definitions

Road
type: Class
subclass of: RoadCzech
comment: Silnice je veřejně přístupná pozemní komunikace určená k užití silničními a jinými vozidly a chodci. Silnice tvoří silniční síť @cs
label: Silnice @cs

1st Class Road
type: Class
subclass of: Road
comment: Silnice I. třídy existují v Česku a na Slovensku. V České republice jsou podle zákona o pozemních komunikacích (č. 13/1997 Sb.) určeny zejména pro dálkovou a mezistátní dopravu. Označují se jednomístným nebo dvojmístným číslem, před nímž se někdy v dokumentaci uvádí ještě římské číslo I oddělené lomítkem. Silnice I. třídy musí v České republice na základě zákona o pozemních komunikacích vlastnit stát.[1] Spravuje je Ředitelství silnic a dálnic.[2] Rychlostní silnice (před jejichž číslo se někdy vkládá ještě písmeno R) jsou v tomto číslování zahrnuty a patří mezi silnice I. třídy. Ve stejném systému jsou číslovány i dálnice, před jejichž číslo se vkládá písmeno D, avšak ty tvoří zvláštní kategorii, t. j. nepatří mezi silnice I. třídy. Silnice I. třídy vystavěná jako rychlostní silnice má obdobné stavebně technické vybavení a provozní podmínky jako dálnice. Zpravidla je z hlediska provozu označená jako silnice pro motorová vozidla. [wiki] @cs
comment: State-owned roads, managed by the Directorate of Roads and Motorways, usually non-directionally divided roads, outside the village and outside the marked parking lots, it is forbidden to stop and stand
comment: silnice I. třídy, která je určena zejména pro dálkovou a mezistátní dopravu, @cs
label: silnice I. třídy @cs

2nd Class Road
type: Class
subclass of: Road
comment: Silnice II. třídy v Česku jsou podle zákona o pozemních komunikacích (č. 13/1997 Sb., § 5) určeny pro dopravu mezi okresy. Silnice II. třídy stejně jako silnice III. třídy musí v České republice na základě zákona o pozemních komunikacích vlastnit kraj, na jehož území se silnice nachází [wiki] @cs
comment: directionally non-divided road, road owned by the region, historically intended to connect the districts
comment: silnice II. třídy, která je určena pro dopravu mezi okresy, @cs
label: silnice II. třídy @cs

3rd Class Road
type: Class
subclass of: Road
comment: Directionally non-divided roads, the lowest category of roads in the Czech Republic, roads owned by the region, historically intended to connect municipalities or their connection to other roads
comment: Silnice III. třídy existují v České republice a na Slovensku v návaznosti na československý systém klasifikace silnic, zavedený na základě silničního zákona č. 135/1961 Sb. V Česku jsou podle zákona o pozemních komunikacích (č. 13/1997 Sb., § 5) určeny k vzájemnému spojení obcí nebo jejich napojení na ostatní pozemní komunikace. Jde o nejnižší kategorii silnic (obecní komunikace od roku 1961 již nespadají do pojmu silnice). Silnice III. třídy (z historických důvodů tradičně nazývané okresní silnice), stejně jako silnice II. třídy, musí v České republice na základě zákona o pozemních komunikacích vlastnit kraj, na jehož území se silnice nachází. [wiki] @cs
comment: silnice III. třídy, která je určena k vzájemnému spojení obcí nebo jejich napojení na ostatní pozemní komunikace @cs
label: silnice III. třídy @cs

sectionsRCE
type: Class
subclass of: SpanishCatalogSections
comment: Sections of a road included in the ROAD CATALOG OF THE NETWORK OF GENERAL INTEREST OF THE Spanish STATE.
comment: Tramos de una carretera recogidos en el CATALOGO DE CARRETERAS DE LA RED DE INTERES GENERAL DEL ESTADO español. @es
label: TramosRCE @es

Utility Road
type: Class
subclass of: RoadCzech
comment: čelová komunikace je pozemní komunikace, která slouží ke spojení jednotlivých nemovitostí pro potřeby vlastníků těchto nemovitostí nebo ke spojení těchto nemovitostí s ostatními pozemními komunikacemi nebo k obhospodařování zemědělských a lesních pozemků. @cs
label: Účelová Komunikace @cs

SpanishCatalogSections
type: Class
subclass of: RoadsDefinitions
comment: Official Catalog of the Spanish National Highway Network (RCE)" presented on December 31 of each year. The information is broken down into different general and provincial lists, with processing, lengths by type of road and PKs.
comment: “Catálogo oficial de la Red de Carreteras del Estado (RCE)” a 31 de diciembre de cada año. La información se desglosa en diferentes listados generales y provinciales, con tramificación, longitudes por tipo de vía y PKs" @es

QuantityValue
type: Class
source: http://qudt.org/schema/qudt#
comment: A quantity value expresses the numerical value of a quantity with respect to a chosen unit of measure.

Unit
type: Class
comment: A unit of measure, or unit, is a particular quantity value that has been chosen as a scale for measuring other quantities the same kind (more generally of equivalent dimension). For example, the meter is a quantity of length that has been rigorously defined and standardized by the BIPM (International Board of Weights and Measures). Any measurement of the length can be expressed as a number multiplied by the unit meter. More formally, the value of a physical quantity Q with respect to a unit (U) is expressed as the scalar multiple of a real number (n) and U, as \\(Q = nU\\).

Autonomia
type: Class
subclass of: UnidadAdministrativa
comment: Autonomous Community or Autonomous City
comment: Comunidad Autónoma o Ciudad Autónoma @es

Ciudad Autónoma
type: Class
subclass of: Autonomia
comment: Autonomous City to which a geographical phenomenon or an administrative entity belongs

Comunidad Autónoma
type: Class
subclass of: Autonomia
comment: Autonomous Community to which a geographical phenomenon or an administrative entity belongs

Provincia
type: Class
subclass of: UnidadAdministrativa
comment: A province is a subnational entity of the State

Feature
type: Class
equivalent class: Objeto Geográfico
contributor: Matthew Perry
creator: OGC GeoSPARQL 1.0 Standard Working Group
description: This class represents the top-level feature type. This class is equivalent to GFI_Feature defined in ISO 19156:2011, and it is superclass of all feature types.

Autopista
type: Class
subclass of: Autopista_Autovia
disjoint with: Autovia
source: Catálogo de Objetos Geográficos BTN100. @es
comment: Communication route, dedicated to road traffic, classified as such by the Ministry of Public Works, and characterized by not having access to the adjoining properties; not cross any other road at the level and consist of different roads for each direction, separated by a median.
comment: Highway
comment: Vía de comunicación, dedicada al tráfico rodado, clasificada como tal por el Ministerio de Fomento, y caracterizada por no tener acceso a las mismas las propiedades colindantes; no cruzar a nivel ninguna otra vía de comunicación y constar de distintas calzadas para cada sentido, separadas por una mediana. @es

Autovia
type: Class
subclass of: Autopista_Autovia
source: Catálogo de Objetos Geográficos BTN100. @es
comment: Carretera con calzadas separadas para los dos sentidos de la circulación, cuyas entradas y salidas no se someten a las exigencias de seguridad de las autopistas. @es
comment: Road with separate lanes for both directions of traffic, whose entrances and exits are not subject to the safety requirements of highways.

RoadSpain
type: Class
subclass of: Objeto Geográfico
subclass of: Restriction
  all values from: string
  on property: title
comment: Camino público, ancho y espacioso, pavimentado y dispuesto para el tránsito de vehículos. (RAE) @es
comment: Public road, wide and spacious, paved and arranged for the transit of vehicles. (RAE)
label: Carretera @es

Carretera autonómica
type: Class
subclass of: Carretera_Convencional
disjoint with: Carretera nacional
source: Catálogo de Objetos Geográficos BTN100. @es
comment: Section of conventional highway of autonomous competence or of any other administration inferior to this one.
comment: Tramo de carretera convencional de competencia autonómica o de cualquier otra administración inferior a ésta. @es

Carretera nacional
type: Class
subclass of: Carretera_Convencional
source: Catálogo de Objetos Geográficos BTN100. @es
comment: Communication route dedicated to road traffic, whose competence corresponds to the Central Administration of the State, classified as a first order road by the Ministry of Public Works (Network of General Interest of the Spanish State).
comment: Vía de comunicación dedicada al tráfico rodado, cuya competencia corresponde a la Administración Central del Estado, clasificada como carretera de primer orden por el Ministerio de Fomento (Red de Interés General del Estado). @es

UnidadAdministrativa
type: Class
subclass of: Objeto Geográfico
comment: La Unión Europea entiende como unidades administrativas aquellas áreas donde los Estados miembros tienen o ejercen sus derechos jurisdiccionales a efectos de administración local, regional y nacional. Están separadas mediante límites administrativos y frecuentemente están organizadas jerárquicamente, reflejando los distintos grados de responsabilidad implicados” [INSPIRE ANEXO 1.Tema 4]. Definen las áreas de cada municipio o condominio, provincia, comunidad autónoma y nación española. @es
comment: The European Union understands as administrative units those areas where the Member States have or exercise their jurisdictional rights for the purposes of local, regional and national administration. They are separated by administrative boundaries and are often hierarchically organized, reflecting the different degrees of responsibility involved” [INSPIRE ANNEX 1.Issue 4]. They define the areas of each municipality or condominium, province, autonomous community and Spanish nation.

Objeto Geográfico
type: Class
subclass of: Restriction
  all values from: date
  on property: created
subclass of: Restriction
  all values from: Literal
  on property: identifier
subclass of: Restriction
  all values from: Literal
  on property: replaces
comment: Geographic features are real-world phenomena associated with a location relative to the Earth about which data is collected, maintained, and disseminated. (ISO_TC_211_Standards_Guide_English.pdf)
comment: Los objetos geográficos son fenómenos del mundo real asociados con una localización relativa a la Tierra respecto a los cuales se recolectan, mantienen y difunden datos. (ISO_TC_211_Starndards_ Guide_ Spanish.pdf) @es

tipo-acceso
type: Class
comment: Tipología que define si la vía es de acceso libre o de peaje. @es
comment: Typology that defines whether the road is free access or toll.

Kilometre
type: NamedIndividual
description: A common metric unit of length or distance. One kilometer equals exactly 1000 meters, about 0.621 371 19 mile, 1093.6133 yards, or 3280.8399 feet. Oddly, higher multiples of the meter are rarely used; even the distances to the farthest galaxies are usually measured in kilometers.
comment: Derived Unit of Measure: Kilometer

Meter
type: NamedIndividual
description: The metric and SI base unit of distance. The 17th General Conference on Weights and Measures in 1983 defined the meter as that distance that makes the speed of light in a vacuum equal to exactly 299 792 458 meters per second. The speed of light in a vacuum, , is one of the fundamental constants of nature. The meter is equal to approximately 1.093 613 3 yards, 3.280 840 feet, or 39.370 079 inches.
comment: Unit of Measure: Meter