LOD SRTI DATEX II ADU
type: Ontology
contributor: Tam Tam Research, CVUT, ESAM Technologies and LMT.
created: 2022/03/31
creator: Julian Gutierrez Moret (https://www.uv.es/uvweb/universidad/es/ficha-persona-1285950309813.html?p2=gumoju) J. Javier Samper Zapater (https://www.uv.es/uvweb/college/en/profile-1285950309813.html?p2=jjsamper&idA=true) IRTIC - (Instituto de Robótica y Tecnologías de la Información y la Comunicación)
description: An RDF/OWL vocabulary to represent Administrative Units within the european LOD-RoadTran18 project (INEA/CEF/ICT/A2018/1803421).
license: https://creativecommons.org/licenses/by/4.0/
publisher: IRTIC - (Instituto de Robotica y Tecnologias de la Informacion y la Comunicacion) @es
preferred namespace prefix: adu
comment: In Spain, the Administrative Areas, municipalities, provinces, etc. , are encoded using the INE code (https://www.ine.es/daco/daco42/codmun/codmunmapa.htm) and is also the code used by the DGT in DATEX II XML. For this reason, the ontology is linked to the already defined ontology of the IGN National Geographic Institute called BTN100, where they define these Administrative Areas and in addition to the name, they use the CodigoINE property ( https://datos.ign.es/def/btn100/index-es.html#UnidadAdministrativa ).
comment: The link class in dtx_srti is administrativeUnit (range): - AdministrativeAreaOfLinearSection hasAdministrativeAreaOfLinearSection max 1 administrativeUnit - PointAlongLinearElement hasAdministrativeAreaOfPoint max 1 administrativeUnit Also it is used for Other descriptions in Location TPEG points: Value of “Description” attribute in the “TpegOtherPointDescriptor” class when the attribute “tpegOtherPointDescriptorType” has as values several enumeration literals from the enumeration “tpegLoc03OtherPointDescriptorSubtypeEnum” : "other" "townname" "regionName" "administrativeAreaName" .
comment: This specific ontology is used in the main dtx_srti to identification of the road administration area which contains the specified linear section (LinearWithinLinearElement , administrativeAreaOfLinearSection) or point (PointAlongLinearElement ,administrativeAreaOfPoint).
version info: 1.0
change note: 2021-12-15 - Added annotation properties - Added the Class ObjectoGeografico from BTN100 to include associated properties.
change note: 2022-01-24: It is included the class "Poblacion" according to the Spanish DGT.
change note: 2022-01-29: Created properties "belongTo" and the inverse "composedOF" Autonomy changes the URI.
change note: 2022-08-04: Added Czech terms.

Country code
type: AnnotationProperty
domain: Country code (Eurostat)

Level
type: AnnotationProperty
domain: Geographical region

Name
type: AnnotationProperty
domain: Geographical region

Region code
type: AnnotationProperty
comment: NUTS or LAU code
domain: Geographical region

created
type: AnnotationProperty
range: Literal
type: DatatypeProperty
domain: Objeto Geográfico

belongToAutonomy
type: ObjectProperty
inverse of: composedOfProvince
domain: Province
range: Autonomy
comment: To specify that a province belong to an autonomy

belongToCountry
type: ObjectProperty
inverse of: composedOfAutonomy
domain: Autonomy
range: Country
comment: To specify that an autonomy belong to a Country

belongToDistrict
type: ObjectProperty
inverse of: composedOfMunicipalitiyCZ
domain: Municipality
range: District
comment: To specify that a Municipality belongs to a District

belongToMunicipality
type: ObjectProperty
inverse of: composedOfTown
domain: Poblacion
range: Municipality
comment: To specify that a town belong to a Municipality

belongToProvince
type: ObjectProperty
inverse of: composedOfMunicipality
domain: Municipality
range: Province
comment: To specify that a Municipality belong to a Province

belongToRegion
type: ObjectProperty
inverse of: composedOfDistrict
domain: District
range: Region
comment: To specify that a Disctict belongs to a Region

belongToState
type: ObjectProperty
inverse of: composedOfRegion
domain: Region
range: Country
comment: To specify that a Region belongs to a Country

composedOfAutonomy
type: ObjectProperty
sub property of: topObjectProperty
domain: Country
range: Autonomy
comment: To specify that a Country is composed of Autonomies

composedOfDistrict
type: ObjectProperty
domain: Region
range: District
comment: To specify that a Region is composed of Districts

composedOfMunicipality
type: ObjectProperty
sub property of: topObjectProperty
domain: Province
range: Municipality
comment: To specify that a Province is composed of Municipalities

composedOfMunicipalitiyCZ
type: ObjectProperty
domain: District
range: Municipality
comment: To specify that a District is composed of Municipalities

composedOfProvince
type: ObjectProperty
domain: Autonomy
range: Province
comment: To specify that an Autonomy is composed of Provincies

composedOfRegion
type: ObjectProperty
domain: Country
range: Region
comment: To specify that a Country is composed of Regions

composedOfTown
type: ObjectProperty
domain: Municipality
range: Poblacion
comment: To specify that a Municipality is composed of Towns

isNutsCodeOf
type: ObjectProperty
sub property of: topObjectProperty
inverse of: nutsCode
domain: NutsResource
range: AdministrativeUnit
comment: isNutsCodeOf. NutsResource is code of an Administrative Unit.

nutsCode
type: ObjectProperty
domain: AdministrativeUnit
range: NutsResource
comment: To specify the NUTS code.

Has parent region
type: ObjectProperty
inverse of: Has subregion
domain: Geographical region
range: Geographical region

Has subregion
type: ObjectProperty
domain: Geographical region
range: Geographical region

code ALERT-C
type: DatatypeProperty
sub property of: identifier
domain: Objeto Geográfico
range: Literal
comment: Administrative area code referencing the country location table, for the purpose of full identification, consisting of country code CID=(0-F), table code TABCD=(00-99) and location code (0-65000). for the Czech Republic CID=2, TABCD=25 Ref: 2.25.180 (Prague-Cakovice area code)
comment: kód administrativní oblasti odkazující do lokační tabulky dané země, pro potřeby celistvé identifikace s skládá z kódu země CID=(0-F), kódu tabulky TABCD=(00-99) a kódu lokace (0-65000). pro ČR CID=2, TABCD=25 př: 2.25.180 (kód oblasti Praha-Čakovice) @cs
label: kód ALERT-C @cs

level
type: DatatypeProperty
domain: Geographical region
range: decimal

name
type: DatatypeProperty
domain: Geographical region
range: string

regionCode
type: DatatypeProperty
domain: Geographical region
range: string
comment: NUTS or LAU code

code RÚIAN
type: DatatypeProperty
sub property of: identifier
domain: Objeto Geográfico
range: Literal
comment: Coding assigned by the RÚIAN Nomenclature
comment: Kód přidělený v rámci číselníků územní identifikace RÚIAN @cs
label: kód RÚIAN @cs

identifier
type: DatatypeProperty
domain: Objeto Geográfico
range: Literal

replace
type: DatatypeProperty
domain: Objeto Geográfico
range: Literal

code INE
type: DatatypeProperty
sub property of: identifier
domain: Objeto Geográfico
range: Literal
comment: Codificación asignada por el Nomenclátor INE @es
comment: Coding assigned by the INE Nomenclature
label: código INE @es

AdmUnitOfCzechia
type: Class
subclass of: AdministrativeUnit
subclass of: Restriction
  on class: NutsResource
  qualified cardinality: 1
  on property: nutsCode
subclass of: Restriction
  all values from: string
  on property: code ALERT-C
subclass of: Restriction
  all values from: string
  on property: code RÚIAN
subclass of: Restriction
  all values from: string
  on property: title
subclass of: Restriction
  on data range: decimal
  qualified cardinality: 1
  on property: level
subclass of: Restriction
  on data range: string
  qualified cardinality: 1
  on property: name
subclass of: Restriction
  on data range: string
  qualified cardinality: 1
  on property: regionCode
comment: The European Union understands administrative units as those areas where the Member States have or exercise their jurisdictional rights for the purposes of local, regional and national administration.

AdministrativeUnit
type: Class
subclass of: Geographical region
subclass of: AdministrativeArea
comment: Generic class to split into Czech or Spanish Administrative Unit

Cadastral Territory
type: Class
subclass of: AdmUnitOfCzechia
comment: A cadastral territory is a technical unit that consists of a locally closed and jointly registered set of real estate in the Land Registry (according to Act No. 256/2013 Coll., on the Land Registry (Cadastral Act), Section 2(h)).
comment: Katastrálním územím se rozumí technická jednotka, kterou tvoří místopisně uzavřený a v katastru nemovitostí společně evidovaný soubor nemovitostí (dle zákona č. 256/2013 Sb., o katastru nemovitostí (katastrální zákon), § 2 písm. h)). @cs
label: Katastrální Území @cs

Region
type: Class
subclass of: AdmUnitOfCzechia
comment: In the Czech Republic, regions are higher territorial self-governing units
comment: Kraje v Česku jsou vyšší územní samosprávné celky, které jsou územními společenstvími občanů s právem na samosprávu. Kraj představuje statistickou územní jednotku na úrovni NUTS 3 @cs
label: Kraj @cs

City District
type: Class
subclass of: AdmUnitOfCzechia
comment: Na základě zákona č. 128/2000 Sb., o obcích (obecní zřízení), ve znění pozdějších změn, se může území statutárního města členit na městské obvody nebo městské části s vlastními orgány samosprávy. Území hlavního města Prahy, pro kterou byl vydán samostatný zákon č. 131/2000 Sb., o hlavním městě Praze, se člení na městské části s vlastními orgány samosprávy. Vymezení území městských obvodů nebo městských částí statutárních měst a městských částí hlavního města Prahy je záležitostí obecně závazných předpisů (statutů měst). @cs
comment: On the basis of Act No. 128/2000 Coll., on Municipalities (Municipal Establishment), as amended, the territory of a statutory city may be divided into municipal districts or municipal parts with their own self-government bodies. The territory of the Capital City of Prague, for which a separate Act No 131/2000 Coll., on the Capital City of Prague, has been issued, shall be divided into urban districts with their own self-governing bodies. The delimitation of the territory of urban districts or urban parts of statutory cities and urban parts of the capital city of Prague is a matter of generally binding regulations (city statutes).
label: Městský Obvod @cs

Municipality
type: Class
subclass of: AdmUnitOfCzechia
comment: A municipality is a basic territorial self-governing community of citizens; it forms a territorial unit which is defined by the boundary of the municipality's territory. The municipality acts in its own name in legal relations and bears the responsibility arising from these relations. For more information see https://cs.wikipedia.org/wiki/Obec_(Česko) or https://www.zakonyprolidi.cz/cs/2000-128
comment: Obec je základním územním samosprávným společenstvím občanů; tvoří územní celek, který je vymezen hranicí území obce. Obec vystupuje v právních vztazích svým jménem a nese odpovědnost z těchto vztahů vyplývající. Více viz https://cs.wikipedia.org/wiki/Obec_(Česko) či https://www.zakonyprolidi.cz/cs/2000-128 @cs
label: Obec @cs

District
type: Class
subclass of: AdmUnitOfCzechia
comment: A district is a medium-level territorial administrative unit and is defined by a list of municipalities and military districts. The territory of the Czech Republic is divided into districts according to Act No. 36/1960 Coll., on the territorial division of the state, §1, as amended. The statistical territorial unit at NUTS 4 level, or later LAU 1, has not always been historically identified with the territorial expression of the element District
comment: Okres je územně správní jednotka středního stupně a je vymezen výčtem obcí a vojenských újezdů. Území České republiky se dělí na okresy dle zákona č. 36/1960 Sb., o územním členění státu, §1, ve znění pozdějších předpisů. Statistická územní jednotka na úrovni NUTS 4, resp. později LAU 1, nebyla v historii vždy ztotožněna s územním vyjádřením prvku Okres @cs
label: Okres @cs

Poblacion
type: Class
subclass of: AdmUnitOfSpain
comment: DGT Rules for TPEG Location townname: first see if the literal is in town, if not, search in municipality other: first see if the literal is in towns, if not, search in province
comment: Reglas DGT para TPEG Localizacion: townname:primero ver si el literal está en población, si no, buscar en municipio other: primero ver si el literal está en población, si no, buscar en provincia @es
label: Town

Country
type: Class
subclass of: AdmUnitOfCzechia
comment: Stát představuje Českou republiku jako správní jednotku pro zeměpisnou oblast se správním orgánem, který má pravomoc přijímat správní nebo politická rozhodnutí pro tuto oblast v právním a institucionálním rámci členského státu Evropské unie. Stát představuje statistickou územní jednotku na úrovni NUTS 0 (statistická klasifikace je ztotožněna s územním vyjádřením prvku Stát). @cs
comment: The state represents the Czech Republic as an administrative unit for a geographical area with an administrative authority that has the power to take administrative or political decisions for that area within the legal and institutional framework of a member state of the European Union. The State represents a statistical territorial unit at NUTS 0 level (the statistical classification is identified with the territorial expression of the State element).
label: Stát @cs

NutsResource
type: Class
comment: NUTS dataset

Country code (Eurostat)
type: Class
subclass of: Geographical region
comment: Member States of the European Union (EU) and other countries have been assigned a two-letter country code, always written in capital letters, and often used as an abbreviation in statistical analyses, tables, graphs or maps.

LAU Region
type: Class
subclass of: Geographical region
comment: Local Administrative Units

NUTS Region
type: Class
subclass of: Geographical region
comment: Nomenclature of Territorial Units for Statistics

Geographical region
type: Class
subclass of: Feature
comment: Geographical region

AdministrativeArea
type: Class
subclass of: Feature
comment: A Schema.org Type Thing > Place > AdministrativeArea
comment: A geographical region, typically under the jurisdiction of a particular government.

Autonomy
type: Class
subclass of: AdmUnitOfSpain
comment: Autonomy (Autonomous Community or Autonomous City) to which a geographical phenomenon or an administrative entity belongs
comment: Autonomía (Comunidad Autónoma o Ciudad Autónoma) a la que pertenece un fenómeno geográfico o una entidad administrativa @es
comment: Uniprovincial or multiprovincial entity with specific territorial limits within the kingdom of Spain, which is endowed with legislative autonomy and executive powers in everything that is not common with the rest of the State.
label: Autonomia @es

Autonomous City
type: Class
subclass of: Autonomy
comment: Autonomous City to which a geographical phenomenon or an administrative entity belongs
label: Ciudad Autónoma @es

Autonomous Community
type: Class
subclass of: Autonomy
comment: Autonomous Community to which a geographical phenomenon or an administrative entity belongs
label: Comunidad Autónoma @es

Jurisdictional Community
type: Class
subclass of: AdmUnitOfSpain
comment: Jurisdictional Community
label: Comunidad Jurisdiccional @es

Municipality
type: Class
subclass of: AdmUnitOfSpain
comment: A municipality is an administrative entity that can group a single locality or several, it can refer to a city or a town.
comment: Un municipio es una entidad administrativa que puede agrupar una sola localidad o varias, puede hacer referencia a una ciudad o un pueblo. @es
label: Municipio @es

Country
type: Class
subclass of: AdmUnitOfSpain
comment: A country is a territory with its own geographical and cultural characteristics, which may or may not constitute a sovereign State or a political entity within a State. It is also used as a synonym for State, a set of political institutions endowed with territory, population and sovereignty.
comment: Un país es un territorio con características geográficas y culturales propias, que puede o no constituir un Estado soberano o una entidad política dentro de un Estado. También es utilizado como sinónimo de Estado, conjunto de instituciones políticas dotadas de territorio, población y soberanía. @es
label: País @es

Province
type: Class
subclass of: AdmUnitOfSpain
comment: A province is a subnational entity of the State
comment: In Spain, < regionName > in Tpeg Location or < administrativeArea > in Location ReferencePoint
comment: Una provincia es una entidad subnacional del Estado @es
label: Provincia @es

Feature
type: Class
equivalent class: Objeto Geográfico
comment: A feature is simply any entity in the real world with some spatial location.

AdmUnitOfSpain
type: Class
subclass of: AdministrativeUnit
subclass of: Restriction
  all values from: string
  on property: title
subclass of: Restriction
  all values from: string
  on property: code INE
source: Catálogo de Objetos Geográficos BTN100 where the official encoding associated is represented by the codigoINE property and its geometry is represented by the geosparql: hasGeometry property.
comment: The European Union understands administrative units as those areas where the Member States have or exercise their jurisdictional rights for the purposes of local, regional and national administration. They are separated by administrative boundaries and are frequently organized hierarchically, reflecting the different degrees of responsibility involved ”[INSPIRE ANNEX 1. Topic 4]. They define the areas of each municipality or condominium, province, autonomous community and Spanish nation.
comment: “La Unión Europea entiende como unidades administrativas aquellas áreas donde los Estados miembros tienen o ejercen sus derechos jurisdiccionales a efectos de administración local, regional y nacional. Están separadas mediante límites administrativos y frecuentemente están organizadas jerárquicamente, reflejando los distintos grados de responsabilidad implicados” [INSPIRE ANEXO 1.Tema 4]. Definen las áreas de cada municipio o condominio, provincia, comunidad autónoma y nación española. @es

Objeto Geográfico
type: Class
subclass of: Restriction
  all values from: date
  on property: created
subclass of: Restriction
  all values from: Literal
  on property: identifier
subclass of: Restriction
  all values from: Literal
  on property: replace
subclass of: Restriction
  on data range: date
  max qualified cardinality: 1
  on property: created
comment: Geographic features are real-world phenomena associated with a location relative to the Earth about which data is collected, maintained, and disseminated. (ISO_TC_211_Standards_Guide_English.pdf)
comment: Los objetos geográficos son fenómenos del mundo real asociados con una localización relativa a la Tierra respecto a los cuales se recolectan, mantienen y difunden datos. (ISO_TC_211_Standards_ Guide_ Spanish.pdf) @es